{"text_format":"1","workbook":"xlsx","n_sheets":3,"sheets":["Lookup","Anesthesia Fee Schedule","Ref"],"not_rendered":{"charts":0,"images":3,"macros":1,"external_links":0,"defined_names":2,"comments":0,"pivot_tables":0},"unopened":[],"bounds":{"document_bytes":16777216,"sheet_cells":100000,"rows_first":2000,"rows_last":500,"rows_between":2000,"halvings":0,"cell_chars":16384,"cell_head_chars":4096},"cells_cut":0,"cells_raw":0,"read":"whole","date_system":"1900"}

{"sheet":"Lookup","index":0,"n_rows":6,"n_cols":10,"rows_kept":6,"cut":false,"hidden":false,"merged":[[0,0,0,8],[1,8,1,9],[3,3,3,8]]}
["Code Lookup Tool (Anesthesia Fee Schedule)"]
[null,null,null,"Code","Anesthesia Value","Payment Method","Base Source","FSI","Prior Auth"]
["Enter code -->",100,1,{"$f":"VLOOKUP(C3,Ref!A4:G271,{2,3,4,5,6,7},)","v":100},5,"Base/Time","CMS","A",0,100]
[null,null,null,"NOTE: The MARFS chapters linked below are recommended for your understanding of these codes but are not to be considered explicit context and do not remove your responsibility to bill properly in accordance with the L&I Provider Agreement, applicable RCWs and WACs, and the MARFS in its entirety."]
[null,null,null,"Chapter 2: Information for All Providers"]
[null,null,null,"Chapter 4: Anesthesia Services"]

{"sheet":"Anesthesia Fee Schedule","index":1,"n_rows":380,"n_cols":9,"rows_kept":380,"cut":false,"hidden":false,"merged":[[100,5,100,6],[96,7,96,11],[98,7,98,11],[99,7,99,11],[100,7,100,11],[98,5,98,6],[97,7,97,11],[96,5,96,6],[99,5,99,6],[22,1,26,3],[96,0,100,1],[96,2,100,4],[92,7,92,11],[93,7,93,11],[94,7,94,11],[84,0,84,1],[97,5,97,6],[95,7,95,11],[89,0,92,1],[89,2,92,4],[90,5,90,6],[93,0,95,1],[95,5,95,6],[84,7,84,11],[85,7,85,11],[83,5,83,6],[83,0,83,1],[82,0,82,11],[85,2,88,4],[92,5,92,6],[91,5,91,6],[83,7,83,11],[84,5,84,6],[85,5,85,6],[87,5,87,6],[88,5,88,6],[89,5,89,6],[86,5,86,6],[102,3,102,5],[14,0,14,11],[86,7,86,11],[87,7,87,11],[88,7,88,11],[89,7,89,11],[20,0,20,11],[93,2,95,4],[84,2,84,4],[93,5,93,6],[90,7,90,11],[18,0,18,11],[83,2,83,4],[85,0,88,1],[94,5,94,6],[91,7,91,11]]}
[]
[]
[]
[]
[]
[]
[]
[]
[]
[]
[]
[]
[]
[]
["Anesthesia Services Fee Schedule"]
[]
[]
[]
["Effective for Dates of Service on or After"]
[]
["2022-07-01"]
[]
[null,"To Skip The Keys\n&\nGo To The Fees\nClick Here"]
[]
[]
[]
[]
[]
[]
[]
[]
[]
[]
[]
[]
[]
[]
[]
[]
[]
[]
[]
[]
[]
[]
[]
[]
[]
[]
[]
[]
[]
[]
[]
[]
[]
[]
[]
[]
[]
[]
[]
[]
[]
[]
[]
[]
[]
[]
[]
[]
[]
[]
[]
[]
[]
[]
[]
[]
[]
[]
["ANESTHESIA SERVICES FEE SCHEDULE                   "]
["FIELD KEY:  "]
["Column Title",null,"Column Description",null,null,"Column Values",null,"Value Definitions"]
["CPTÒ CODE",null,"2021 CPT® anesthesia code.",null,null,null,null,"2021 CPT® anesthesia code."]
["ANES VALUE",null,"Indicates the anesthesia base units, maximum dollar value, or coverage for the anesthesia service.",null,null,"Number",null,"Anesthesia base units for services paid with the base and time payment method."]
[null,null,null,null,null,"Dollar Value",null,"Fee schedule dollar value for services paid with the maximum fee method."]
[null,null,null,null,null,"By Report",null,"Service paid on a “by report” basis."]
[null,null,null,null,null,"Not Covered",null,"Procedure code is not covered."]
["PAYMENT METHOD",null,"Indicates the payment method for the anesthesia service.",null,null,"Base/Time",null,"Service paid with base and time units."]
[null,null,null,null,null,"By Report",null,"Service paid on a “by report” basis."]
[null,null,null,null,null,"Maximum Fee",null,"Service paid based on a maximum dollar value."]
[null,null,null,null,null,"Not Covered",null,"Procedure code is not covered,"]
["BASE SOURCE",null,"Indicates the source of the anesthesia base units.",null,null,"CMS",null,"Base unit source is the Centers for Medicare and Medicaid Services (CMS)."]
[null,null,null,null,null,"ASA",null,"Base unit source is the American Society of Anesthesiologists’ Relative Value Guide."]
[null,null,null,null,null,"N/A",null,"Service not paid by base and time unit method"]
["FSI",null,"Fee Schedule Indicator \nThis column indicates the payment status for the procedure code.",null,null,"A",null,"Paid using base units"]
[null,null,null,null,null,"F",null,"Flat Fee developed by the department"]
[null,null,null,null,null,"N",null,"No fee or RVUs available, paid By Report"]
[null,null,null,null,null,"R",null,"Fee set by RBRVS RVUs"]
[null,null,null,null,null,"X",null,"Non-covered code"]
[]
[null,null,null,"Anesthesia Fees"]
[null,null,null,"CPTÒ  CODE","ANES VALUE","PAYMENT METHOD","BASE SOURCE","FSI","PRIOR AUTH"]
[null,null,null,100,5,"Base/Time","CMS","A"]
[null,null,null,102,6,"Base/Time","CMS","A"]
[null,null,null,103,5,"Base/Time","CMS","A"]
[null,null,null,104,4,"Base/Time","CMS","A"]
[null,null,null,120,5,"Base/Time","CMS","A"]
[null,null,null,124,4,"Base/Time","CMS","A"]
[null,null,null,126,4,"Base/Time","CMS","A"]
[null,null,null,140,5,"Base/Time","CMS","A"]
[null,null,null,142,4,"Base/Time","CMS","A"]
[null,null,null,144,6,"Base/Time","CMS","A"]
[null,null,null,145,6,"Base/Time","CMS","A"]
[null,null,null,147,4,"Base/Time","CMS","A"]
[null,null,null,148,4,"Base/Time","CMS","A"]
[null,null,null,160,5,"Base/Time","CMS","A"]
[null,null,null,162,7,"Base/Time","CMS","A"]
[null,null,null,164,4,"Base/Time","CMS","A"]
{"$rows_left_out":261}
{"sheet":"Ref","index":2,"n_rows":279,"n_cols":6,"rows_kept":279,"cut":false,"hidden":true,"merged":[]}
[]
[]
[]
[{"$f":"SEARCH(Lookup!$J$3,B4)","v":1},100,5,"Base/Time","CMS","A"]
[{"$f":"SEARCH(Lookup!$J$3,B5)","v":{"$error":"#VALUE!"}},102,6,"Base/Time","CMS","A"]
[{"$f":"SEARCH(Lookup!$J$3,B6)","v":{"$error":"#VALUE!"}},103,5,"Base/Time","CMS","A"]
[{"$f":"SEARCH(Lookup!$J$3,B7)","v":{"$error":"#VALUE!"}},104,4,"Base/Time","CMS","A"]
[{"$f":"SEARCH(Lookup!$J$3,B8)","v":{"$error":"#VALUE!"}},120,5,"Base/Time","CMS","A"]
[{"$f":"SEARCH(Lookup!$J$3,B9)","v":{"$error":"#VALUE!"}},124,4,"Base/Time","CMS","A"]
[{"$f":"SEARCH(Lookup!$J$3,B10)","v":{"$error":"#VALUE!"}},126,4,"Base/Time","CMS","A"]
[{"$f":"SEARCH(Lookup!$J$3,B11)","v":{"$error":"#VALUE!"}},140,5,"Base/Time","CMS","A"]
[{"$f":"SEARCH(Lookup!$J$3,B12)","v":{"$error":"#VALUE!"}},142,4,"Base/Time","CMS","A"]
[{"$f":"SEARCH(Lookup!$J$3,B13)","v":{"$error":"#VALUE!"}},144,6,"Base/Time","CMS","A"]
[{"$f":"SEARCH(Lookup!$J$3,B14)","v":{"$error":"#VALUE!"}},145,6,"Base/Time","CMS","A"]
[{"$f":"SEARCH(Lookup!$J$3,B15)","v":{"$error":"#VALUE!"}},147,4,"Base/Time","CMS","A"]
[{"$f":"SEARCH(Lookup!$J$3,B16)","v":{"$error":"#VALUE!"}},148,4,"Base/Time","CMS","A"]
[{"$f":"SEARCH(Lookup!$J$3,B17)","v":{"$error":"#VALUE!"}},160,5,"Base/Time","CMS","A"]
[{"$f":"SEARCH(Lookup!$J$3,B18)","v":{"$error":"#VALUE!"}},162,7,"Base/Time","CMS","A"]
[{"$f":"SEARCH(Lookup!$J$3,B19)","v":{"$error":"#VALUE!"}},164,4,"Base/Time","CMS","A"]
[{"$f":"SEARCH(Lookup!$J$3,B20)","v":{"$error":"#VALUE!"}},170,5,"Base/Time","CMS","A"]
[{"$f":"SEARCH(Lookup!$J$3,B21)","v":{"$error":"#VALUE!"}},172,6,"Base/Time","CMS","A"]
[{"$f":"SEARCH(Lookup!$J$3,B22)","v":{"$error":"#VALUE!"}},174,6,"Base/Time","CMS","A"]
[{"$f":"SEARCH(Lookup!$J$3,B23)","v":{"$error":"#VALUE!"}},176,7,"Base/Time","CMS","A"]
[{"$f":"SEARCH(Lookup!$J$3,B24)","v":{"$error":"#VALUE!"}},190,5,"Base/Time","CMS","A"]
[{"$f":"SEARCH(Lookup!$J$3,B25)","v":{"$error":"#VALUE!"}},192,7,"Base/Time","CMS","A"]
[{"$f":"SEARCH(Lookup!$J$3,B26)","v":{"$error":"#VALUE!"}},210,11,"Base/Time","CMS","A"]
[{"$f":"SEARCH(Lookup!$J$3,B27)","v":{"$error":"#VALUE!"}},211,10,"Base/Time","CMS","A"]
[{"$f":"SEARCH(Lookup!$J$3,B28)","v":{"$error":"#VALUE!"}},212,5,"Base/Time","CMS","A"]
[{"$f":"SEARCH(Lookup!$J$3,B29)","v":{"$error":"#VALUE!"}},214,9,"Base/Time","CMS","A"]
[{"$f":"SEARCH(Lookup!$J$3,B30)","v":{"$error":"#VALUE!"}},215,9,"Base/Time","CMS","A"]
[{"$f":"SEARCH(Lookup!$J$3,B31)","v":{"$error":"#VALUE!"}},216,15,"Base/Time","CMS","A"]
[{"$f":"SEARCH(Lookup!$J$3,B32)","v":{"$error":"#VALUE!"}},218,13,"Base/Time","CMS","A"]
[{"$f":"SEARCH(Lookup!$J$3,B33)","v":{"$error":"#VALUE!"}},220,10,"Base/Time","CMS","A"]
[{"$f":"SEARCH(Lookup!$J$3,B34)","v":{"$error":"#VALUE!"}},222,6,"Base/Time","CMS","A"]
[{"$f":"SEARCH(Lookup!$J$3,B35)","v":{"$error":"#VALUE!"}},300,5,"Base/Time","CMS","A"]
[{"$f":"SEARCH(Lookup!$J$3,B36)","v":{"$error":"#VALUE!"}},320,6,"Base/Time","CMS","A"]
[{"$f":"SEARCH(Lookup!$J$3,B37)","v":{"$error":"#VALUE!"}},322,3,"Base/Time","CMS","A"]
[{"$f":"SEARCH(Lookup!$J$3,B38)","v":{"$error":"#VALUE!"}},326,7,"Not Covered","N/A","X"]
[{"$f":"SEARCH(Lookup!$J$3,B39)","v":{"$error":"#VALUE!"}},350,10,"Base/Time","CMS","A"]
[{"$f":"SEARCH(Lookup!$J$3,B40)","v":{"$error":"#VALUE!"}},352,5,"Base/Time","CMS","A"]
[{"$f":"SEARCH(Lookup!$J$3,B41)","v":{"$error":"#VALUE!"}},400,3,"Base/Time","CMS","A"]
[{"$f":"SEARCH(Lookup!$J$3,B42)","v":{"$error":"#VALUE!"}},402,5,"Base/Time","CMS","A"]
[{"$f":"SEARCH(Lookup!$J$3,B43)","v":{"$error":"#VALUE!"}},404,5,"Base/Time","CMS","A"]
[{"$f":"SEARCH(Lookup!$J$3,B44)","v":{"$error":"#VALUE!"}},406,13,"Base/Time","CMS","A"]
[{"$f":"SEARCH(Lookup!$J$3,B45)","v":{"$error":"#VALUE!"}},410,4,"Base/Time","CMS","A"]
[{"$f":"SEARCH(Lookup!$J$3,B46)","v":{"$error":"#VALUE!"}},450,5,"Base/Time","CMS","A"]
[{"$f":"SEARCH(Lookup!$J$3,B47)","v":{"$error":"#VALUE!"}},454,3,"Base/Time","CMS","A"]
[{"$f":"SEARCH(Lookup!$J$3,B48)","v":{"$error":"#VALUE!"}},470,6,"Base/Time","CMS","A"]
[{"$f":"SEARCH(Lookup!$J$3,B49)","v":{"$error":"#VALUE!"}},472,10,"Base/Time","CMS","A"]
[{"$f":"SEARCH(Lookup!$J$3,B50)","v":{"$error":"#VALUE!"}},474,13,"Base/Time","CMS","A"]
[{"$f":"SEARCH(Lookup!$J$3,B51)","v":{"$error":"#VALUE!"}},500,15,"Base/Time","CMS","A"]
[{"$f":"SEARCH(Lookup!$J$3,B52)","v":{"$error":"#VALUE!"}},520,6,"Base/Time","CMS","A"]
[{"$f":"SEARCH(Lookup!$J$3,B53)","v":{"$error":"#VALUE!"}},522,4,"Base/Time","CMS","A"]
[{"$f":"SEARCH(Lookup!$J$3,B54)","v":{"$error":"#VALUE!"}},524,4,"Base/Time","CMS","A"]
[{"$f":"SEARCH(Lookup!$J$3,B55)","v":{"$error":"#VALUE!"}},528,8,"Base/Time","CMS","A"]
[{"$f":"SEARCH(Lookup!$J$3,B56)","v":{"$error":"#VALUE!"}},529,11,"Not Covered","N/A","X"]
[{"$f":"SEARCH(Lookup!$J$3,B57)","v":{"$error":"#VALUE!"}},530,4,"Base/Time","CMS","A"]
[{"$f":"SEARCH(Lookup!$J$3,B58)","v":{"$error":"#VALUE!"}},532,4,"Base/Time","CMS","A"]
[{"$f":"SEARCH(Lookup!$J$3,B59)","v":{"$error":"#VALUE!"}},534,7,"Base/Time","CMS","A"]
[{"$f":"SEARCH(Lookup!$J$3,B60)","v":{"$error":"#VALUE!"}},537,10,"Base/Time","CMS","A"]
[{"$f":"SEARCH(Lookup!$J$3,B61)","v":{"$error":"#VALUE!"}},539,18,"Base/Time","CMS","A"]
[{"$f":"SEARCH(Lookup!$J$3,B62)","v":{"$error":"#VALUE!"}},540,12,"Base/Time","CMS","A"]
[{"$f":"SEARCH(Lookup!$J$3,B63)","v":{"$error":"#VALUE!"}},541,15,"Base/Time","CMS","A"]
[{"$f":"SEARCH(Lookup!$J$3,B64)","v":{"$error":"#VALUE!"}},542,15,"Base/Time","CMS","A"]
[{"$f":"SEARCH(Lookup!$J$3,B65)","v":{"$error":"#VALUE!"}},546,15,"Base/Time","CMS","A"]
[{"$f":"SEARCH(Lookup!$J$3,B66)","v":{"$error":"#VALUE!"}},548,17,"Base/Time","CMS","A"]
[{"$f":"SEARCH(Lookup!$J$3,B67)","v":{"$error":"#VALUE!"}},550,10,"Base/Time","CMS","A"]
[{"$f":"SEARCH(Lookup!$J$3,B68)","v":{"$error":"#VALUE!"}},560,15,"Base/Time","CMS","A"]
[{"$f":"SEARCH(Lookup!$J$3,B69)","v":{"$error":"#VALUE!"}},561,25,"Not Covered","N/A","X"]
[{"$f":"SEARCH(Lookup!$J$3,B70)","v":{"$error":"#VALUE!"}},562,20,"Base/Time","CMS","A"]
[{"$f":"SEARCH(Lookup!$J$3,B71)","v":{"$error":"#VALUE!"}},563,25,"Base/Time","CMS","A"]
[{"$f":"SEARCH(Lookup!$J$3,B72)","v":{"$error":"#VALUE!"}},566,25,"Base/Time","CMS","A"]
[{"$f":"SEARCH(Lookup!$J$3,B73)","v":{"$error":"#VALUE!"}},567,18,"Base/Time","CMS","A"]
[{"$f":"SEARCH(Lookup!$J$3,B74)","v":{"$error":"#VALUE!"}},580,20,"Base/Time","CMS","A"]
[{"$f":"SEARCH(Lookup!$J$3,B75)","v":{"$error":"#VALUE!"}},600,10,"Base/Time","CMS","A"]
[{"$f":"SEARCH(Lookup!$J$3,B76)","v":{"$error":"#VALUE!"}},604,13,"Base/Time","CMS","A"]
[{"$f":"SEARCH(Lookup!$J$3,B77)","v":{"$error":"#VALUE!"}},620,10,"Base/Time","CMS","A"]
[{"$f":"SEARCH(Lookup!$J$3,B78)","v":{"$error":"#VALUE!"}},625,13,"Base/Time","CMS","A"]
[{"$f":"SEARCH(Lookup!$J$3,B79)","v":{"$error":"#VALUE!"}},626,15,"Base/Time","CMS","A"]
[{"$f":"SEARCH(Lookup!$J$3,B80)","v":{"$error":"#VALUE!"}},630,8,"Base/Time","CMS","A"]
[{"$f":"SEARCH(Lookup!$J$3,B81)","v":{"$error":"#VALUE!"}},632,7,"Base/Time","CMS","A"]
[{"$f":"SEARCH(Lookup!$J$3,B82)","v":{"$error":"#VALUE!"}},635,4,"Base/Time","CMS","A"]
[{"$f":"SEARCH(Lookup!$J$3,B83)","v":{"$error":"#VALUE!"}},640,3,"Base/Time","CMS","A"]
[{"$f":"SEARCH(Lookup!$J$3,B84)","v":{"$error":"#VALUE!"}},670,13,"Base/Time","CMS","A"]
[{"$f":"SEARCH(Lookup!$J$3,B85)","v":{"$error":"#VALUE!"}},700,4,"Base/Time","CMS","A"]
[{"$f":"SEARCH(Lookup!$J$3,B86)","v":{"$error":"#VALUE!"}},702,4,"Base/Time","CMS","A"]
[{"$f":"SEARCH(Lookup!$J$3,B87)","v":{"$error":"#VALUE!"}},730,5,"Base/Time","CMS","A"]
[{"$f":"SEARCH(Lookup!$J$3,B88)","v":{"$error":"#VALUE!"}},731,5,"Base/Time","CMS","A"]
[{"$f":"SEARCH(Lookup!$J$3,B89)","v":{"$error":"#VALUE!"}},732,6,"Base/Time","CMS","A"]
[{"$f":"SEARCH(Lookup!$J$3,B90)","v":{"$error":"#VALUE!"}},750,4,"Base/Time","CMS","A"]
[{"$f":"SEARCH(Lookup!$J$3,B91)","v":{"$error":"#VALUE!"}},752,6,"Base/Time","CMS","A"]
[{"$f":"SEARCH(Lookup!$J$3,B92)","v":{"$error":"#VALUE!"}},754,7,"Base/Time","CMS","A"]
[{"$f":"SEARCH(Lookup!$J$3,B93)","v":{"$error":"#VALUE!"}},756,7,"Base/Time","CMS","A"]
[{"$f":"SEARCH(Lookup!$J$3,B94)","v":{"$error":"#VALUE!"}},770,15,"Base/Time","CMS","A"]
[{"$f":"SEARCH(Lookup!$J$3,B95)","v":{"$error":"#VALUE!"}},790,7,"Base/Time","CMS","A"]
[{"$f":"SEARCH(Lookup!$J$3,B96)","v":{"$error":"#VALUE!"}},792,13,"Base/Time","CMS","A"]
[{"$f":"SEARCH(Lookup!$J$3,B97)","v":{"$error":"#VALUE!"}},794,8,"Base/Time","CMS","A"]
[{"$f":"SEARCH(Lookup!$J$3,B98)","v":{"$error":"#VALUE!"}},796,30,"Not Covered","N/A","A"]
[{"$f":"SEARCH(Lookup!$J$3,B99)","v":{"$error":"#VALUE!"}},797,11,"Base/Time","CMS","X"]
[{"$f":"SEARCH(Lookup!$J$3,B100)","v":{"$error":"#VALUE!"}},800,4,"Base/Time","CMS","A"]
[{"$f":"SEARCH(Lookup!$J$3,B101)","v":{"$error":"#VALUE!"}},802,5,"Base/Time","CMS","A"]
[{"$f":"SEARCH(Lookup!$J$3,B102)","v":{"$error":"#VALUE!"}},811,4,"Base/Time","CMS","A"]
[{"$f":"SEARCH(Lookup!$J$3,B103)","v":{"$error":"#VALUE!"}},812,3,"Base/Time","CMS","A"]
[{"$f":"SEARCH(Lookup!$J$3,B104)","v":{"$error":"#VALUE!"}},813,5,"Not Covered","N/A","A"]
[{"$f":"SEARCH(Lookup!$J$3,B105)","v":{"$error":"#VALUE!"}},820,5,"Not Covered","N/A","A"]
[{"$f":"SEARCH(Lookup!$J$3,B106)","v":{"$error":"#VALUE!"}},830,4,"Base/Time","CMS","A"]
[{"$f":"SEARCH(Lookup!$J$3,B107)","v":{"$error":"#VALUE!"}},832,6,"Base/Time","CMS","A"]
[{"$f":"SEARCH(Lookup!$J$3,B108)","v":{"$error":"#VALUE!"}},834,5,"Base/Time","CMS","X"]
[{"$f":"SEARCH(Lookup!$J$3,B109)","v":{"$error":"#VALUE!"}},836,6,"Base/Time","CMS","X"]
[{"$f":"SEARCH(Lookup!$J$3,B110)","v":{"$error":"#VALUE!"}},840,6,"Base/Time","CMS","A"]
[{"$f":"SEARCH(Lookup!$J$3,B111)","v":{"$error":"#VALUE!"}},842,4,"Not Covered","N/A","A"]
[{"$f":"SEARCH(Lookup!$J$3,B112)","v":{"$error":"#VALUE!"}},844,7,"Base/Time","CMS","A"]
[{"$f":"SEARCH(Lookup!$J$3,B113)","v":{"$error":"#VALUE!"}},846,8,"Base/Time","CMS","A"]
[{"$f":"SEARCH(Lookup!$J$3,B114)","v":{"$error":"#VALUE!"}},848,8,"Base/Time","CMS","A"]
[{"$f":"SEARCH(Lookup!$J$3,B115)","v":{"$error":"#VALUE!"}},851,6,"Base/Time","CMS","X"]
[{"$f":"SEARCH(Lookup!$J$3,B116)","v":{"$error":"#VALUE!"}},860,6,"Base/Time","CMS","A"]
[{"$f":"SEARCH(Lookup!$J$3,B117)","v":{"$error":"#VALUE!"}},862,7,"Base/Time","CMS","A"]
[{"$f":"SEARCH(Lookup!$J$3,B118)","v":{"$error":"#VALUE!"}},864,8,"Base/Time","CMS","A"]
[{"$f":"SEARCH(Lookup!$J$3,B119)","v":{"$error":"#VALUE!"}},865,7,"Base/Time","CMS","A"]
[{"$f":"SEARCH(Lookup!$J$3,B120)","v":{"$error":"#VALUE!"}},866,10,"Base/Time","CMS","A"]
{"$rows_left_out":159}